BDBM50042994 (2E)-3-(3,4-dihydroxyphenyl)-1-(2,4,6-trihydroxyphenyl)prop-2-en-1-one::CHEMBL127409::trans-2',3,4,4',6'-pentahydroxychalcone
SMILES Oc1cc(O)c(C(=O)\C=C\c2ccc(O)c(O)c2)c(O)c1
InChI Key InChIKey=CRBYNQCDRNZCNX-DUXPYHPUSA-N
Data  2 IC50
  Tab Delimited (TSV)   2D SDfile   Computed 3D by Vconf -m prep SDfile
Find this compound or compounds like it in BindingDB:
Activity Spreadsheet -- Enzyme Inhibition Constant Data from BindingDB
Found 2 hits for monomerid = 50042994
TargetPolyunsaturated fatty acid 5-lipoxygenase(Rattus norvegicus)TBA
LigandPNGBDBM50042994((2E)-3-(3,4-dihydroxyphenyl)-1-(2,4,6-trihydroxyph...)
Affinity DataIC50:  140nM. Assay description: Inhibition of 5-lipoxygenase in rat RBL1 cells
In DepthDetails Article
TargetPolyunsaturated fatty acid 5-lipoxygenase(Rattus norvegicus)TBA
LigandPNGBDBM50042994((2E)-3-(3,4-dihydroxyphenyl)-1-(2,4,6-trihydroxyph...)
Affinity DataIC50:  140nM. Assay description: In vitro inhibition against 5-lipoxygenase in RBL-1 cells was determined
In DepthDetails ArticlePubMed